{"text_format":"1","workbook":"xlsx","n_sheets":2,"sheets":["Garantías_TTE_AS_PR","Parametros"],"not_rendered":{"charts":0,"images":3,"macros":1,"external_links":0,"defined_names":46,"comments":1,"pivot_tables":0},"unopened":[],"bounds":{"document_bytes":16777216,"sheet_cells":100000,"rows_first":2000,"rows_last":500,"rows_between":2000,"halvings":0,"cell_chars":16384,"cell_head_chars":4096},"cells_cut":0,"cells_raw":0,"read":"row_number_cap","date_system":"1900"}

{"sheet":"Garantías_TTE_AS_PR","index":0,"n_rows":26,"n_cols":13,"rows_kept":26,"cut":false,"hidden":false,"merged":[[17,3,17,5],[18,3,18,5],[19,3,19,5],[8,3,8,5],[12,3,12,5],[13,3,13,5],[14,3,14,5],[15,3,15,5],[16,3,16,5],[4,3,4,5],[5,3,5,5],[7,3,7,5],[10,3,10,5],[11,3,11,5],[24,12,25,12],[24,11,25,11],[24,5,25,5],[0,1,1,12],[24,1,25,1],[24,2,25,2],[24,3,25,3],[9,3,9,5],[24,6,24,7],[24,8,24,9],[24,10,25,10],[24,4,25,4],[20,3,20,5],[21,3,21,5],[17,8,18,11],[19,8,20,11]],"read":"row_number_cap"}
[null,"Capacity contracting guarantee simulator\n(Simulador de garantías de contratación de capacidad)"]
[]
[null,null," "]
[]
[null,null,"Type of service","Individualized services"]
[null,null,"Service"]
[]
[null,null,"Product"]
[null,null,{"$f":"IF(OR(D8=\"Intraday. ≤23h duration\",D8=\"Intraday\",AND(D6=\"PVB exit to consumer\",LEFT(D8,11)=\"Intraday\")),\"Intraday product hours\",\"\")","v":""},null,null,null,{"$f":"IF(D8=\"Intradiario. Duración ≤23h\",\"Horas\",\"\")","v":""}]
[null,null,{"$f":"IF(OR(D6=\"PVB entry from transport network\",D6=\"PVB exit\"),\"Infrastructure\",\"\")","v":""}]
{"$rows_left_out":17}
{"sheet":"Parametros","index":1,"n_rows":511,"n_cols":77,"rows_kept":511,"cut":false,"hidden":true,"merged":[[2,73,2,74],[144,42,144,50],[145,42,158,42],[145,43,146,44],[145,45,146,45],[145,46,146,46],[145,47,146,47],[145,48,146,48],[145,49,146,49],[145,50,146,50],[96,42,96,50],[97,43,98,44],[97,45,98,45],[97,46,98,46],[97,47,98,47],[97,48,98,48],[97,49,98,49],[97,50,98,50],[80,42,80,50],[81,42,94,42],[81,43,82,44],[81,45,82,45],[81,46,82,46],[81,47,82,47],[81,48,82,48],[81,49,82,49],[81,50,82,50],[97,42,110,42],[64,42,64,50],[65,42,78,42],[65,43,66,44],[65,45,66,45],[65,46,66,46],[65,47,66,47],[65,48,66,48],[65,49,66,49],[65,50,66,50],[48,42,48,50],[49,42,62,42],[49,43,50,44],[49,45,50,45],[49,46,50,46],[49,47,50,47],[49,48,50,48],[49,49,50,49],[49,50,50,50],[32,42,32,50],[33,42,46,42],[33,43,34,44],[33,45,34,45],[33,46,34,46],[33,47,34,47],[33,48,34,48],[33,49,34,49],[33,50,34,50],[16,42,16,50],[17,42,30,42],[17,43,18,44],[17,45,18,45],[17,46,18,46],[17,47,18,47],[17,48,18,48],[17,49,18,49],[17,50,18,50],[0,0,0,19],[1,1,2,1],[1,2,2,2],[1,5,2,5],[1,4,2,4],[1,6,2,6],[1,7,2,7],[1,0,2,0],[1,17,2,17],[1,8,2,8],[1,12,2,12],[1,15,2,15],[1,19,2,19],[1,13,2,13],[1,9,2,9],[1,14,2,14],[1,3,2,3],[1,10,2,10],[1,11,2,11],[0,21,0,24],[0,42,0,50],[1,27,2,27],[1,28,2,28],[1,30,2,30],[1,31,1,32],[1,33,1,34],[1,21,2,21],[1,23,2,23],[1,45,2,45],[1,47,2,47],[1,42,14,42],[1,29,2,29],[1,48,2,48],[1,43,2,44],[0,26,0,40],[1,65,2,65],[1,16,2,16],[1,49,2,49],[1,50,2,50],[1,18,2,18],[1,20,2,20],[1,55,2,55],[1,56,1,57],[1,22,2,22],[1,26,2,26],[1,46,2,46],[1,24,2,24],[1,37,1,38],[1,39,1,40],[1,52,2,52],[1,53,2,53],[0,70,0,71],[1,70,2,70],[1,71,2,71],[143,28,143,29],[112,42,112,50],[113,42,126,42],[113,43,114,44],[113,45,114,45],[113,46,114,46],[113,47,114,47],[113,48,114,48],[113,49,114,49],[113,50,114,50],[1,61,2,61],[0,61,0,63],[1,62,2,62],[1,63,2,63],[1,59,2,59],[1,35,1,36],[0,67,0,68],[1,68,2,68],[1,67,2,67],[0,52,0,53],[0,55,0,57],[128,42,128,50],[129,42,142,42],[129,43,130,44],[129,45,130,45],[129,46,130,46],[129,47,130,47],[129,48,130,48],[129,49,130,49],[129,50,130,50]]}
["Administración por SERVICIO/PRODUCTO",null,null,null,null,null,null,null,null,null,null,null,null,null,null,null,null,null,null,null,null,"Administración por SERVICIO",null,null,null,null,"Administración de peajes",null,null,null,null,null,null,null,null,null,null,null,null,null,null,null,"Administración PEAJES.  Almacenamientos subterráneos (AASS)",null,null,null,null,null,null,null,null,null,"Administración Factor de Riesgo",null,null,"Administración de parámetros",null,null,null,"Tipos de servicios",null,"Gestión tramaños de buques para descargas",null,null,null,"Naturaleza",null,"Infrastructure",null,null,"AASS - Ciclos"]
["Tipo servicio","Servicio","Tipo duración","Infraestructura","Servicio/producto","Fórmula","Qa","Auction premium","Tf","Tv","Cregas","Cunit","M","DEN","Días/horas","FR","Int","Resultado",null,null,"Tve","Tipo servicio","Servicio","Un. Servicio","Un. Facturación",null,"Para buscar","Tipo servicio","Servicio","Tamaño/Peaje","Infraestructura","Término por cap. Contratada",null,"Término por volumen",null,"Término por cliente",null,"Otros costes de regasificación",null,"Cargos unitarios",null,null,"Productos estándar capacidad","Mes",null,"Intraday (05)","Daily (04)","Montly (03)","Quarterly (02)","Annual (01)","Undefined",null,"Periodo","F",null,"Parámetro","Característica",null,null,"Tipos de servicios",null,"Código buques","Rango inferior\n(kWh)","Rango superior (inclusive)\n(kWh)",null,"Naturaleza",null,"Entrada","Salida",null,"Mes","Ciclo"]
[null,null,null,null,null,null,null,null,null,null,null,null,null,null,null,null,null,null,null,null,null,null,null,null,null,null,null,null,null,null,null,"Valor","Unidad","Valor","Unidad","Valor","Unidad","Valor","Unidad","Valor","Unidad",null,null,null,null,null,null,null,null,null,null,null,null,null,null,null,"Valor","Unidades",null,null,null,null,null,null,null,null,null,null,null,null,null,null,null,"Fechas año bisiesto",null,"Año natural bisiesto"]
["Individualized services","Regasification","Annual",{"$f":"IF(Garantías_TTE_AS_PR!$D$10=\"\",\"\",Garantías_TTE_AS_PR!$D$10)","v":""},{"$f":"B4&C4","v":"RegasificationAnnual"},"[(TCR x M + prima)/den + TVR] x Qa x D x FR",{"$f":"Garantías_TTE_AS_PR!$D$13","v":0},{"$f":"Garantías_TTE_AS_PR!$D$17","v":0},{"$f":"VLOOKUP(B4,$AC$4:$AH$219,4,FALSE)","v":1.9876999999999999E-2},{"$f":"VLOOKUP(B4,$AC$4:$AH$219,6,FALSE)","v":2.1900000000000001E-4},{"$f":"VLOOKUP(B4,$AC$4:$AL$219,10,FALSE)","v":0},{"$f":"VLOOKUP(B4,$AC$4:$AN$220,12,FALSE)","v":0},{"$f":"IF(C4=\"Annual\",VLOOKUP(MONTH(Garantías_TTE_AS_PR!$D$12),$AS$36:$AY$47,6),(IF(C4=\"Quarterly\",VLOOKUP(MONTH(Garantías_TTE_AS_PR!$D$12),$AS$36:$AY$47,5),(IF(C4=\"Monthly\",VLOOKUP(MONTH(Garantías_TTE_AS_PR!$D$12),$AS$36:$AY$47,4),(IF(OR(C4=\"Daily\",C4=\"Intraday. 24h duration\"),VLOOKUP(MONTH(Garantías_TTE_AS_PR!$D$12),$AS$36:$AY$47,3),(IF(OR(C4=\"Intraday\",C4=\"Intraday. ≤23h duration\"),VLOOKUP(MONTH(Garantías_TTE_AS_PR!$D$12),$AS$36:$AY$47,2),\"\")))))))))","v":1},{"$f":"IF(Garantías_TTE_AS_PR!$D$8=\"Annual\",IFERROR(_xlfn.IFS(AND(Garantías_TTE_AS_PR!$D$12>=$BV$4,Garantías_TTE_AS_PR!$D$12<$BW$4),$BE$6,AND(Garantías_TTE_AS_PR!$D$12>=$BV$5,Garantías_TTE_AS_PR!$D$12<$BW$5),$BE$6,AND(Garantías_TTE_AS_PR!$D$12>=$BV$6,Garantías_TTE_AS_PR!$D$12<$BW$6),$BE$6,AND(Garantías_TTE_AS_PR!$D$12>=$BV$7,Garantías_TTE_AS_PR!$D$12<$BW$7),$BE$6,AND(Garantías_TTE_AS_PR!$D$12>=$BV$8,Garantías_TTE_AS_PR!$D$12<$BW$8),$BE$6),$BE$5),(IF(OR(YEAR(Garantías_TTE_AS_PR!$D$12)=2020,YEAR(Garantías_TTE_AS_PR!$D$12)=2024,YEAR(Garantías_TTE_AS_PR!$D$12)=2028,YEAR(Garantías_TTE_AS_PR!$D$12)=2032,YEAR(Garantías_TTE_AS_PR!$D$12)=2036,YEAR(Garantías_TTE_AS_PR!$D$12)=2040,YEAR(Garantías_TTE_AS_PR!$D$12)=2044,YEAR(Garantías_TTE_AS_PR!$D$12)=2048),$BE$6,$BE$5)))","v":365},{"$f":"Garantías_TTE_AS_PR!$D$18","v":""},{"$f":"VLOOKUP(C4,$BA$4:$BB$51,2,FALSE)","v":2},{"$f":"IF(Garantías_TTE_AS_PR!$D$11=\"Firm\",1,IF(Garantías_TTE_AS_PR!$D$11=\"Uninterruptible\",1,1))","v":1},{"$f":"ROUND((((I4*M4)*Q4+H4)/N4+J4)*O4*G4*P4,2)","v":{"$error":"#VALUE!"}},{"$f":"B4&C4","v":"RegasificationAnnual"},{"$f":"CONCATENATE(\"[(\",I4,\" x \",M4,\" + \",H4,\")\", \" / \",N4,\" + \",J4,\")] x \",TEXT(G4,\"#.##0\"),\" x \",O4,\" x \",P4)","v":"[(0,019877 x 1 + 0) / 365 + 0,000219)] x 0 x  x 2"},null,"Bundled services","Underground natural gas storage, injection, extraction","kWh","€/(kWh/day)/year",null,{"$f":"IF(AC4=\"\",\"\",CONCATENATE(AC4,AD4,AE4))","v":"Underground natural gas storage"},"Individualized","Underground natural gas storage",null,null,2.5560000000000001E-3,"€/(kWh/día)/año",0,"€/kWh",null,null,null,null,null,null,null,null,"January",1,2.4,1.6,1.3,1,1,1,null,"Undefined",2,null,"IEH",9.3599999999999998E-4,"c€/kWh",null,"Bundled services",null,"S",0,272160000,null,"Firm",null,"CI Tarifa","VIP Pirineos",null,1,"Extraction",null,"2023-03-01","2024-03-01","2024-01-01","2024-12-31"]
["Individualized services","Regasification","Quarterly",{"$f":"IF(Garantías_TTE_AS_PR!$D$10=\"\",\"\",Garantías_TTE_AS_PR!$D$10)","v":""},{"$f":"B5&C5","v":"RegasificationQuarterly"},"[(TCR x M + prima)/den + TVR] x Qa x D x FR",{"$f":"Garantías_TTE_AS_PR!$D$13","v":0},{"$f":"Garantías_TTE_AS_PR!$D$17","v":0},{"$f":"VLOOKUP(B5,$AC$4:$AH$219,4,FALSE)","v":1.9876999999999999E-2},2.1900000000000001E-4,0,0,{"$f":"IF(C5=\"Annual\",VLOOKUP(MONTH(Garantías_TTE_AS_PR!$D$12),$AS$36:$AY$47,6),(IF(C5=\"Quarterly\",VLOOKUP(MONTH(Garantías_TTE_AS_PR!$D$12),$AS$36:$AY$47,5),(IF(C5=\"Monthly\",VLOOKUP(MONTH(Garantías_TTE_AS_PR!$D$12),$AS$36:$AY$47,4),(IF(OR(C5=\"Daily\",C5=\"Intraday. 24h duration\"),VLOOKUP(MONTH(Garantías_TTE_AS_PR!$D$12),$AS$36:$AY$47,3),(IF(OR(C5=\"Intraday\",C5=\"Intraday. ≤23h duration\"),VLOOKUP(MONTH(Garantías_TTE_AS_PR!$D$12),$AS$36:$AY$47,2),\"\")))))))))","v":1.2},{"$f":"IF(Garantías_TTE_AS_PR!$D$8=\"Quarterly\",IFERROR(_xlfn.IFS(AND(Garantías_TTE_AS_PR!$D$12>=$BX$4,Garantías_TTE_AS_PR!$D$12<$BY$4),$BE$6,AND(Garantías_TTE_AS_PR!$D$12>=$BX$5,Garantías_TTE_AS_PR!$D$12<$BY$5),$BE$6,AND(Garantías_TTE_AS_PR!$D$12>=$BX$6,Garantías_TTE_AS_PR!$D$12<$BY$6),$BE$6,AND(Garantías_TTE_AS_PR!$D$12>=$BX$7,Garantías_TTE_AS_PR!$D$12<$BY$7),$BE$6,AND(Garantías_TTE_AS_PR!$D$12>=$BX$8,Garantías_TTE_AS_PR!$D$12<$BY$8),$BE$6),$BE$5),(IF(OR(YEAR(Garantías_TTE_AS_PR!$D$12)=2020,YEAR(Garantías_TTE_AS_PR!$D$12)=2024,YEAR(Garantías_TTE_AS_PR!$D$12)=2028,YEAR(Garantías_TTE_AS_PR!$D$12)=2032,YEAR(Garantías_TTE_AS_PR!$D$12)=2036,YEAR(Garantías_TTE_AS_PR!$D$12)=2040,YEAR(Garantías_TTE_AS_PR!$D$12)=2044,YEAR(Garantías_TTE_AS_PR!$D$12)=2048),$BE$6,$BE$5)))","v":365},{"$f":"Garantías_TTE_AS_PR!$D$18","v":""},2,{"$f":"IF(Garantías_TTE_AS_PR!$D$11=\"Firm\",1,IF(Garantías_TTE_AS_PR!$D$11=\"Uninterruptible\",1,1))","v":1},{"$f":"ROUND((((I5*M5)*Q5+H5)/N5+J5)*O5*G5*P5,2)","v":{"$error":"#VALUE!"}},"RegasificationQuarterly",{"$f":"CONCATENATE(\"[(\",I5,\" x \",M5,\" + \",H5,\")\", \" / \",N5,\" + \",J5,\")] x \",TEXT(G5,\"#.##0\"),\" x \",O5,\" x \",P5)","v":"[(0,019877 x 1,2 + 0) / 365 + 0,000219)] x 0 x  x 2"},null,"Bundled services","DAR (unloading, LNG storage and regasification)","kWh","€/ship",null,{"$f":"IF(AC5=\"\",\"\",CONCATENATE(AC5,AD5,AE5))","v":"Injection"},"Individualized","Injection",null,null,9.6387E-2,"€/(kWh/día)/año",0,"€/kWh",null,null,null,null,null,null,null,null,"February",2,2.1,1.3,1.1000000000000001,1,1,1,null,"Annual",2,null,"Días año no bisiesto",365,"Días",null,"Individualized services",null,"M",272160000,510300000,null,"Uninterruptible",null,"CI Almería","VIP Ibérico",null,2,"Extraction",null,"2027-03-01","2028-03-01","2028-01-01","2028-12-31"]
["Individualized services","Regasification","Monthly",{"$f":"IF(Garantías_TTE_AS_PR!$D$10=\"\",\"\",Garantías_TTE_AS_PR!$D$10)","v":""},{"$f":"B6&C6","v":"RegasificationMonthly"},"[(TCR x M + prima)/den + TVR] x Qa x D x FR",{"$f":"Garantías_TTE_AS_PR!$D$13","v":0},{"$f":"Garantías_TTE_AS_PR!$D$17","v":0},{"$f":"VLOOKUP(B6,$AC$4:$AH$219,4,FALSE)","v":1.9876999999999999E-2},2.1900000000000001E-4,0,0,{"$f":"IF(C6=\"Annual\",VLOOKUP(MONTH(Garantías_TTE_AS_PR!$D$12),$AS$36:$AY$47,6),(IF(C6=\"Quarterly\",VLOOKUP(MONTH(Garantías_TTE_AS_PR!$D$12),$AS$36:$AY$47,5),(IF(C6=\"Monthly\",VLOOKUP(MONTH(Garantías_TTE_AS_PR!$D$12),$AS$36:$AY$47,4),(IF(OR(C6=\"Daily\",C6=\"Intraday. 24h duration\"),VLOOKUP(MONTH(Garantías_TTE_AS_PR!$D$12),$AS$36:$AY$47,3),(IF(OR(C6=\"Intraday\",C6=\"Intraday. ≤23h duration\"),VLOOKUP(MONTH(Garantías_TTE_AS_PR!$D$12),$AS$36:$AY$47,2),\"\")))))))))","v":1.3},{"$f":"IF(Garantías_TTE_AS_PR!$D$8=\"Monthly\",IFERROR(_xlfn.IFS(AND(Garantías_TTE_AS_PR!$D$12>=$BX$4,Garantías_TTE_AS_PR!$D$12<$BY$4),$BE$6,AND(Garantías_TTE_AS_PR!$D$12>=$BX$5,Garantías_TTE_AS_PR!$D$12<$BY$5),$BE$6,AND(Garantías_TTE_AS_PR!$D$12>=$BX$6,Garantías_TTE_AS_PR!$D$12<$BY$6),$BE$6,AND(Garantías_TTE_AS_PR!$D$12>=$BX$7,Garantías_TTE_AS_PR!$D$12<$BY$7),$BE$6,AND(Garantías_TTE_AS_PR!$D$12>=$BX$8,Garantías_TTE_AS_PR!$D$12<$BY$8),$BE$6),$BE$5),(IF(OR(YEAR(Garantías_TTE_AS_PR!$D$12)=2020,YEAR(Garantías_TTE_AS_PR!$D$12)=2024,YEAR(Garantías_TTE_AS_PR!$D$12)=2028,YEAR(Garantías_TTE_AS_PR!$D$12)=2032,YEAR(Garantías_TTE_AS_PR!$D$12)=2036,YEAR(Garantías_TTE_AS_PR!$D$12)=2040,YEAR(Garantías_TTE_AS_PR!$D$12)=2044,YEAR(Garantías_TTE_AS_PR!$D$12)=2048),$BE$6,$BE$5)))","v":365},{"$f":"Garantías_TTE_AS_PR!$D$18","v":""},1,{"$f":"IF(Garantías_TTE_AS_PR!$D$11=\"Firm\",1,IF(Garantías_TTE_AS_PR!$D$11=\"Uninterruptible\",1,1))","v":1},{"$error":"#VALUE!"},"RegasificationMonthly","[(0,019877 x 1,3 + 0) / 365 + 0,000219)] x 0 x  x 1",null,"Bundled services","DARE (unloading, LNG storage, regasification and PVB entry)","kWh","€/ship",null,"Extraction","Individualized","Extraction",null,null,"0,071538","€/(kWh/día)/año",0,"€/kWh",null,null,null,null,null,null,null,null,"March",3,1.9,1.2,1,1,1,1,null,"Quarterly",2,null,"Días año bisiesto",366,"Días",null,null,null,"L",510300000,1020600000,null,null,null,"VIP Pirineos","CI Tarifa",null,3,"Extraction",null,"2031-03-01","2032-03-01","2032-01-01","2032-12-31"]
["Individualized services","Regasification","Daily",{"$f":"IF(Garantías_TTE_AS_PR!$D$10=\"\",\"\",Garantías_TTE_AS_PR!$D$10)","v":""},"RegasificationDaily","[(TCR x M + prima)/den + TVR] x Qa x D x FR",{"$f":"Garantías_TTE_AS_PR!$D$13","v":0},{"$f":"Garantías_TTE_AS_PR!$D$17","v":0},1.9876999999999999E-2,2.1900000000000001E-4,0,0,{"$f":"IF(C7=\"Annual\",VLOOKUP(MONTH(Garantías_TTE_AS_PR!$D$12),$AS$36:$AY$47,6),(IF(C7=\"Quarterly\",VLOOKUP(MONTH(Garantías_TTE_AS_PR!$D$12),$AS$36:$AY$47,5),(IF(C7=\"Monthly\",VLOOKUP(MONTH(Garantías_TTE_AS_PR!$D$12),$AS$36:$AY$47,4),(IF(OR(C7=\"Daily\",C7=\"Intraday. 24h duration\"),VLOOKUP(MONTH(Garantías_TTE_AS_PR!$D$12),$AS$36:$AY$47,3),(IF(OR(C7=\"Intraday\",C7=\"Intraday. ≤23h duration\"),VLOOKUP(MONTH(Garantías_TTE_AS_PR!$D$12),$AS$36:$AY$47,2),\"\")))))))))","v":1.7},{"$f":"IF(Garantías_TTE_AS_PR!$D$8=\"Daily\",IFERROR(_xlfn.IFS(AND(Garantías_TTE_AS_PR!$D$12>=$BX$4,Garantías_TTE_AS_PR!$D$12<$BY$4),$BE$6,AND(Garantías_TTE_AS_PR!$D$12>=$BX$5,Garantías_TTE_AS_PR!$D$12<$BY$5),$BE$6,AND(Garantías_TTE_AS_PR!$D$12>=$BX$6,Garantías_TTE_AS_PR!$D$12<$BY$6),$BE$6,AND(Garantías_TTE_AS_PR!$D$12>=$BX$7,Garantías_TTE_AS_PR!$D$12<$BY$7),$BE$6,AND(Garantías_TTE_AS_PR!$D$12>=$BX$8,Garantías_TTE_AS_PR!$D$12<$BY$8),$BE$6),$BE$5),(IF(OR(YEAR(Garantías_TTE_AS_PR!$D$12)=2020,YEAR(Garantías_TTE_AS_PR!$D$12)=2024,YEAR(Garantías_TTE_AS_PR!$D$12)=2028,YEAR(Garantías_TTE_AS_PR!$D$12)=2032,YEAR(Garantías_TTE_AS_PR!$D$12)=2036,YEAR(Garantías_TTE_AS_PR!$D$12)=2040,YEAR(Garantías_TTE_AS_PR!$D$12)=2044,YEAR(Garantías_TTE_AS_PR!$D$12)=2048),$BE$6,$BE$5)))","v":365},{"$f":"Garantías_TTE_AS_PR!$D$18","v":""},{"$f":"VLOOKUP(C7,$BA$4:$BB$51,2,FALSE)","v":1},{"$f":"IF(Garantías_TTE_AS_PR!$D$11=\"Firm\",1,IF(Garantías_TTE_AS_PR!$D$11=\"Uninterruptible\",1,1))","v":1},{"$error":"#VALUE!"},"RegasificationDaily","[(0,019877 x 1,7 + 0) / 365 + 0,000219)] x 0 x  x 1",{"$f":"I7*M7/365+J7","v":3.1157780821917811E-4},"Bundled services","AR (LNG storage and regasification)","kWh","€/kWh/year",null,"LNG storage","Individualized","LNG storage",null,null,5.5999999999999995E-4,"€/(kWh/día)/año",3.0000000000000001E-6,"€/kWh",null,null,null,null,null,null,null,null,"April",4,2.1,1.3,1.1000000000000001,1,1,1,null,"Mensual",1,null,"Horas año no bisiesto",8760,"Horas",null,null,null,"XL",1020600000,1469664000,null,null,null,"VIP Ibérico","GNL",null,4,"Injection",null,"2035-03-01","2036-03-01","2036-01-01","2036-12-31"]
["Individualized services","Regasification","Intraday. 24h duration",{"$f":"IF(Garantías_TTE_AS_PR!$D$10=\"\",\"\",Garantías_TTE_AS_PR!$D$10)","v":""},"RegasificationIntraday. 24h duration","[(TCR x M + prima)/den + TVR] x Qa x D x FR",{"$f":"Garantías_TTE_AS_PR!$D$13","v":0},{"$f":"Garantías_TTE_AS_PR!$D$17","v":0},1.9876999999999999E-2,2.1900000000000001E-4,0,0,{"$f":"IF(C8=\"Annual\",VLOOKUP(MONTH(Garantías_TTE_AS_PR!$D$12),$AS$36:$AY$47,6),(IF(C8=\"Quarterly\",VLOOKUP(MONTH(Garantías_TTE_AS_PR!$D$12),$AS$36:$AY$47,5),(IF(C8=\"Monthly\",VLOOKUP(MONTH(Garantías_TTE_AS_PR!$D$12),$AS$36:$AY$47,4),(IF(OR(C8=\"Daily\",C8=\"Intraday. 24h duration\"),VLOOKUP(MONTH(Garantías_TTE_AS_PR!$D$12),$AS$36:$AY$47,3),(IF(OR(C8=\"Intraday\",C8=\"Intraday. ≤23h duration\"),VLOOKUP(MONTH(Garantías_TTE_AS_PR!$D$12),$AS$36:$AY$47,2),\"\")))))))))","v":1.7},{"$f":"IF(Garantías_TTE_AS_PR!$D$8=\"Intraday. 24h duration\",IFERROR(_xlfn.IFS(AND(Garantías_TTE_AS_PR!$D$12>=$BX$4,Garantías_TTE_AS_PR!$D$12<$BY$4),$BE$6,AND(Garantías_TTE_AS_PR!$D$12>=$BX$5,Garantías_TTE_AS_PR!$D$12<$BY$5),$BE$6,AND(Garantías_TTE_AS_PR!$D$12>=$BX$6,Garantías_TTE_AS_PR!$D$12<$BY$6),$BE$6,AND(Garantías_TTE_AS_PR!$D$12>=$BX$7,Garantías_TTE_AS_PR!$D$12<$BY$7),$BE$6,AND(Garantías_TTE_AS_PR!$D$12>=$BX$8,Garantías_TTE_AS_PR!$D$12<$BY$8),$BE$6),$BE$5),(IF(OR(YEAR(Garantías_TTE_AS_PR!$D$12)=2020,YEAR(Garantías_TTE_AS_PR!$D$12)=2024,YEAR(Garantías_TTE_AS_PR!$D$12)=2028,YEAR(Garantías_TTE_AS_PR!$D$12)=2032,YEAR(Garantías_TTE_AS_PR!$D$12)=2036,YEAR(Garantías_TTE_AS_PR!$D$12)=2040,YEAR(Garantías_TTE_AS_PR!$D$12)=2044,YEAR(Garantías_TTE_AS_PR!$D$12)=2048),$BE$6,$BE$5)))","v":365},{"$f":"Garantías_TTE_AS_PR!$D$18","v":""},1,{"$f":"IF(Garantías_TTE_AS_PR!$D$11=\"Firm\",1,IF(Garantías_TTE_AS_PR!$D$11=\"Uninterruptible\",1,1))","v":1},{"$error":"#VALUE!"},"RegasificationIntraday. 24h duration","[(0,019877 x 1,7 + 0) / 365 + 0,000219)] x 0 x  x 1",null,"Bundled services","ARE (LNG storage, regasification and PVB entry)","kWh","€/kWh/year",null,"Regasification","Individualized","Regasification",null,null,1.9876999999999999E-2,"€/(kWh/día)/año",2.1900000000000001E-4,"€/kWh",null,null,null,null,null,null,null,null,"May",5,2.1,1.3,1.1000000000000001,1,1,1,null,"Monthly",1,null,"Horas año bisiesto",8784,"Horas",null,null,null,"XXL",1469664000,null,null,null,null,"GNL","AASS",null,5,"Injection",null,"2039-03-01","2040-03-01","2040-01-01","2040-12-31"]
["Individualized services","Regasification","Intraday. ≤23h duration",{"$f":"IF(Garantías_TTE_AS_PR!$D$10=\"\",\"\",Garantías_TTE_AS_PR!$D$10)","v":""},"RegasificationIntraday. ≤23h duration","[(TCR x M + prima) x (Qa x 24 / H) x H / den + TVR x Qa] x FR",{"$f":"Garantías_TTE_AS_PR!$D$13","v":0},{"$f":"Garantías_TTE_AS_PR!$D$17","v":0},1.9876999999999999E-2,2.1900000000000001E-4,0,0,{"$f":"IF(C9=\"Annual\",VLOOKUP(MONTH(Garantías_TTE_AS_PR!$D$12),$AS$36:$AY$47,6),(IF(C9=\"Quarterly\",VLOOKUP(MONTH(Garantías_TTE_AS_PR!$D$12),$AS$36:$AY$47,5),(IF(C9=\"Monthly\",VLOOKUP(MONTH(Garantías_TTE_AS_PR!$D$12),$AS$36:$AY$47,4),(IF(OR(C9=\"Daily\",C9=\"Intraday. 24h duration\"),VLOOKUP(MONTH(Garantías_TTE_AS_PR!$D$12),$AS$36:$AY$47,3),(IF(OR(C9=\"Intraday\",C9=\"Intraday. ≤23h duration\"),VLOOKUP(MONTH(Garantías_TTE_AS_PR!$D$12),$AS$36:$AY$47,2),\"\")))))))))","v":6},{"$f":"IF(Garantías_TTE_AS_PR!$D$8=\"Intraday. ≤23h duration\",IFERROR(_xlfn.IFS(AND(Garantías_TTE_AS_PR!$D$12>=$BX$4,Garantías_TTE_AS_PR!$D$12<$BY$4),$BE$8,AND(Garantías_TTE_AS_PR!$D$12>=$BX$5,Garantías_TTE_AS_PR!$D$12<$BY$5),$BE$8,AND(Garantías_TTE_AS_PR!$D$12>=$BX$6,Garantías_TTE_AS_PR!$D$12<$BY$6),$BE$8,AND(Garantías_TTE_AS_PR!$D$12>=$BX$7,Garantías_TTE_AS_PR!$D$12<$BY$7),$BE$8,AND(Garantías_TTE_AS_PR!$D$12>=$BX$8,Garantías_TTE_AS_PR!$D$12<$BY$8),$BE$8),$BE$7),(IF(OR(YEAR(Garantías_TTE_AS_PR!$D$12)=2020,YEAR(Garantías_TTE_AS_PR!$D$12)=2024,YEAR(Garantías_TTE_AS_PR!$D$12)=2028,YEAR(Garantías_TTE_AS_PR!$D$12)=2032,YEAR(Garantías_TTE_AS_PR!$D$12)=2036,YEAR(Garantías_TTE_AS_PR!$D$12)=2040,YEAR(Garantías_TTE_AS_PR!$D$12)=2044,YEAR(Garantías_TTE_AS_PR!$D$12)=2048),$BE$8,$BE$7)))","v":8760},{"$f":"Garantías_TTE_AS_PR!$D$9","v":0},{"$f":"VLOOKUP(C9,$BA$4:$BB$51,2,FALSE)","v":1},{"$f":"IF(Garantías_TTE_AS_PR!$D$11=\"Firm\",1,IF(Garantías_TTE_AS_PR!$D$11=\"Uninterruptible\",1,1))","v":1},{"$f":"ROUND((((I9*M9)*Q9+H9)/(N9/24)+J9)*G9*P9,2)","v":0},"RegasificationIntraday. ≤23h duration",{"$f":"CONCATENATE(\"[(\",I9,\" x \",M9,\" + \",H9,\")\",\" x (\",TEXT(G9,\"#.##0\"),\" x 24 / \",O9, \") x \",O9,\" / \",N9,\" + \",J9,\" x \",TEXT(G9,\"#.##0\"),\")] x \",P9)","v":"[(0,019877 x 6 + 0) x (0 x 24 / 0) x 0 / 8760 + 0,000219 x 0)] x 1"},null,"Individualized services","Underground natural gas storage","kWh","€/(kWh/day)/year",null,"LNG truck loading","Individualized","LNG truck loading",null,null,2.2806E-2,"€/(kWh/día)/año",3.3100000000000002E-4,"€/kWh",null,null,1.22E-4,"€/kWh y año",null,null,null,null,"June",6,2.1,1.3,1.1000000000000001,1,1,1,null,"Daily",1,null,"Factor riesgo distribución",2,"meses",null,null,null,null,null,null,null,null,null,"YAC Marismas",null,null,6,"Injection"]
["Individualized services","LNG truck loading","Annual",{"$f":"IF(Garantías_TTE_AS_PR!$D$10=\"\",\"\",Garantías_TTE_AS_PR!$D$10)","v":""},"LNG truck loadingAnnual","[(TCCC x M + prima)/den + TVCC + Ocreg + IEH] x Qa x D x FR",{"$f":"Garantías_TTE_AS_PR!$D$13","v":0},{"$f":"Garantías_TTE_AS_PR!$D$17","v":0},2.2806E-2,3.3100000000000002E-4,1.22E-4,0,{"$f":"IF(C10=\"Annual\",VLOOKUP(MONTH(Garantías_TTE_AS_PR!$D$12),$AS$52:$AY$63,6),(IF(C10=\"Quarterly\",VLOOKUP(MONTH(Garantías_TTE_AS_PR!$D$12),$AS$52:$AY$63,5),(IF(C10=\"Monthly\",VLOOKUP(MONTH(Garantías_TTE_AS_PR!$D$12),$AS$52:$AY$63,4),(IF(OR(C10=\"Daily\",C10=\"Intraday. 24h duration\"),VLOOKUP(MONTH(Garantías_TTE_AS_PR!$D$12),$AS$52:$AY$63,3),(IF(OR(C10=\"Intraday\",C10=\"Intraday. ≤23h duration\"),VLOOKUP(MONTH(Garantías_TTE_AS_PR!$D$12),$AS$52:$AY$63,2),\"\")))))))))","v":1},{"$f":"IF(Garantías_TTE_AS_PR!$D$8=\"Annual\",IFERROR(_xlfn.IFS(AND(Garantías_TTE_AS_PR!$D$12>=$BV$4,Garantías_TTE_AS_PR!$D$12<$BW$4),$BE$6,AND(Garantías_TTE_AS_PR!$D$12>=$BV$5,Garantías_TTE_AS_PR!$D$12<$BW$5),$BE$6,AND(Garantías_TTE_AS_PR!$D$12>=$BV$6,Garantías_TTE_AS_PR!$D$12<$BW$6),$BE$6,AND(Garantías_TTE_AS_PR!$D$12>=$BV$7,Garantías_TTE_AS_PR!$D$12<$BW$7),$BE$6,AND(Garantías_TTE_AS_PR!$D$12>=$BV$8,Garantías_TTE_AS_PR!$D$12<$BW$8),$BE$6),$BE$5),(IF(OR(YEAR(Garantías_TTE_AS_PR!$D$12)=2020,YEAR(Garantías_TTE_AS_PR!$D$12)=2024,YEAR(Garantías_TTE_AS_PR!$D$12)=2028,YEAR(Garantías_TTE_AS_PR!$D$12)=2032,YEAR(Garantías_TTE_AS_PR!$D$12)=2036,YEAR(Garantías_TTE_AS_PR!$D$12)=2040,YEAR(Garantías_TTE_AS_PR!$D$12)=2044,YEAR(Garantías_TTE_AS_PR!$D$12)=2048),$BE$6,$BE$5)))","v":365},{"$f":"Garantías_TTE_AS_PR!$D$18","v":""},2,{"$f":"IF(Garantías_TTE_AS_PR!$D$11=\"Firm\",1,IF(Garantías_TTE_AS_PR!$D$11=\"Uninterruptible\",1,1))","v":1},{"$f":"ROUND((((I10*M10)*Q10+H10)/N10+J10+K10+$BE$4)*O10*G10*P10,2)","v":{"$error":"#VALUE!"}},"LNG truck loadingAnnual",{"$f":"CONCATENATE(\"[(\",I10,\" x \",M10,\" + \",H10,\")\", \" / \",N10,\" + \",J10,\" + \",K10,\" + \",$BE$4,\")] x \",TEXT(G10,\"#.##0\"),\" x \",O10,\" x \",P10)","v":"[(0,022806 x 1 + 0) / 365 + 0,000331 + 0,000122 + 0,000936)] x 0 x  x 2"},null,"Individualized services","LNG storage","kWh","€/(kWh/day)/year",null,"Virtual liquefaction","Individualized","Virtual liquefaction",null,null,1.3649999999999999E-3,"€/(kWh/día)/año",0,"€/kWh",null,null,null,null,null,null,null,null,"July",7,2.4,1.6,1.3,1.3,1,1,null,"Intraday",1,null,"Número días distribución",30,"días",null,null,null,null,null,null,null,null,null,"YAC Aznalcázar",null,null,7,"Injection",null,"2023-11-01","2024-03-01"]
{"$rows_left_out":501}